{"text_format":"1","workbook":"xlsx","n_sheets":16,"sheets":["Master Data","Title","Instructions - detailed","Quick User Guide","ENTER DETAILS HERE_Costing Tab","Summary","Major Funder Tables (DRAFT)","Expenditure Plan","Foreign Exchange - OPTIONAL","In-kind Calculator - OPTIONAL","Quick Salary Calc - OPTIONAL","HERDC Info","Staff Salaries","Drop Down","ACAD","IO"],"not_rendered":{"charts":0,"images":5,"macros":1,"external_links":2,"defined_names":80,"comments":5,"pivot_tables":0},"unopened":[],"bounds":{"document_bytes":16777216,"sheet_cells":100000,"rows_first":2000,"rows_last":500,"rows_between":2000,"halvings":0,"cell_chars":16384,"cell_head_chars":4096},"cells_cut":0,"cells_raw":0,"read":"whole","date_system":"1900"}

{"sheet":"Master Data","index":0,"n_rows":134,"n_cols":79,"rows_kept":134,"cut":false,"hidden":true,"merged":[[19,58,19,59],[18,58,18,59],[17,58,17,59],[14,58,14,59],[13,58,13,59],[1,7,1,10],[1,17,1,20],[1,23,1,51],[1,69,1,72],[1,65,1,66],[1,54,1,55]]}
[]
[null,"Expiry Date",null,null,"Drop-down Selections",null,null,"HERDC",null,null,null,null,null,null,"Affiliates",null,null,"Org Structure",null,null,null,null,null,"Salaries",null,null,null,null,null,null,null,null,null,null,null,null,null,null,null,null,null,null,null,null,null,null,null,null,null,null,null,null,null,null,"Operating Expenses",null,null,null,"Stipends",null,null,null,"Travel Expenses",null,null,"Overhead Rates",null,null,null,"Indirect Cost Allocation",null,null,null,null,null,"CPI Rate",null,null,"Collaborator Expenses"]
[]
[null,"Date",null,null,"Project Type",null,null,"HERDC Category","HERDC Name",null,null,null,null,null,"Organisation",null,null,"Faculty","ABLE","HMS","SET",null,null,"Cont & Fixed Term Salaries",2024,2025,2026,2027,2028,2029,2030,2031,2032,2033,2034,2035,null,"Segment",null,"Levels","Employment Type",null,"Month","Period","No. of months left in the year",null,"Rate","Unit","Amount",null,"Continuing & Fixed Term Oncost Type","%",null,null,"Types","Quantity",null,null,"Year","Amount",null,null,"Purpose",null,null,"Types","%",null,null,"Project Type - % of expense","Faculty","School","DRI",null,null,"Rate",null,null,"Types"]
[null,45657,null,null,"Consultancy",null,null,"Category 1","Australian Competetive Grant R&D Income",null,null,null,null,null,"NO Affiliate",null,null,"ABLE","Adelaide Business School","Adelaide Dental School","AIML - Projects",null,null,"Level A-1",78544,81293,{"$f":"Z5*(1+$X$120)","v":84138.25499999999},87083.093924999979,90131.002212374966,93285.587289808085,96550.582844951365,99929.853244524653,103427.39810808301,107047.35704186591,110794.0145383312,114671.80504717279,null,"Discretionary",null,"Level A-1","Academic",null,"January",1,12,null,"Hourly","Number of hours",{"$f":"AW7*36.75","v":1617},null,"LSL",3.2500000000000001E-2,null,null,"High Performing Computer","Not required",null,null,2024,34125,null,null,"Conference",null,null,"Salary Overhead",0.55000000000000004,null,null,"Contract Research",0.1,0.05,0.05,null,null,null,null,null,"Salaries"]
[null,null,null,null,"Contract Research",null,null,"Category 2","Other Public Sector R&D Income",null,null,null,null,null,"AWRI",null,null,"HMS","Adelaide Law School","Adelaide Medical School","Centre for Auto Safety & Res",null,null,"Level A-2",82879,85780,{"$f":"Z6*(1+$X$120)","v":88782.299999999988},91889.680499999988,95105.819317499976,98434.522993612467,101879.7312983889,105445.5218938325,109136.11516011662,112955.87919072069,116909.33496239591,121001.16168607975,null,"Tied",null,"Level A-2","Academic",null,"February",2,11,null,"Daily","Number of days",{"$f":"AW7*5","v":220},null,"Payroll  ",4.9500000000000002E-2,null,null,"Temporary/Agency Staff Costs","Hours per year",null,null,2025,{"$f":"BH5*1.05","v":35831.25},null,null,"Field",null,null,"Operating Expenses Overhead",0.15,null,null,"Consultancy",0.1167,6.6699999999999995E-2,6.6600000000000006E-2,null,null,4.1000000000000002E-2,null,null,"Operating Expenses"]
{"$rows_left_out":129}
{"sheet":"Title","index":1,"n_rows":27,"n_cols":6,"rows_kept":27,"cut":false,"hidden":false,"merged":[[0,3,2,18],[3,3,4,18],[25,3,25,4],[26,3,26,4],[25,5,25,6],[26,5,26,6],[5,3,23,18]]}
[null,null,null,"This file has expired. Existing CPMs can still be viewed. However, for new applications, please download the current file from"]
[]
[]
[null,null,null,"https://www.adelaide.edu.au/finance/"]
[]
[null,null,null,"UoA Costing Pricing Tool (CPT)"]
{"$rows_left_out":22}
{"sheet":"Instructions - detailed","index":2,"n_rows":148,"n_cols":5,"rows_kept":148,"cut":false,"hidden":false,"merged":[[0,2,1,4],[2,2,2,4]]}
[null,null,{"$f":"Title!$D$1","v":"This file has expired. Existing CPMs can still be viewed. However, for new applications, please download the current file from"}]
[]
[null,null,{"$f":"Title!$D$4","v":"https://www.adelaide.edu.au/finance/"}]
[null,null,"Please enter data in the yellow cells only in the \"ENTER DETAILS HERE Costing tab\"."]
[]
[null,"To access each section of the Costing  Tab, press the Button at the top of the page."]
{"$rows_left_out":143}
{"sheet":"Quick User Guide","index":3,"n_rows":60,"n_cols":3,"rows_kept":60,"cut":false,"hidden":false,"merged":[[0,2,1,4],[2,2,2,4]]}
[null,null,{"$f":"Title!$D$1","v":"This file has expired. Existing CPMs can still be viewed. However, for new applications, please download the current file from"}]
[]
[null,null,{"$f":"Title!$D$4","v":"https://www.adelaide.edu.au/finance/"}]
[null,null,"Please enter data in the yellow cells only in the \"ENTER DETAILS HERE Costing tab\"."]
[]
[null,"To access each section of the Costing  Tab, press the Button at the top of the page."]
{"$rows_left_out":55}
{"sheet":"ENTER DETAILS HERE_Costing Tab","index":4,"n_rows":265,"n_cols":47,"rows_kept":265,"cut":false,"hidden":false,"merged":[[3,41,3,43],[3,29,3,39],[162,29,162,39],[185,29,185,39],[185,41,185,43],[186,41,187,41],[186,42,187,42],[186,43,187,43],[210,29,210,39],[210,41,210,43],[61,29,61,39],[61,41,61,43],[62,43,63,43],[62,42,63,42],[62,41,63,41],[85,29,85,39],[85,41,85,43],[86,41,87,41],[86,42,87,42],[86,43,87,43],[86,39,87,39],[211,41,212,41],[211,42,212,42],[211,43,212,43],[163,41,164,41],[163,42,164,42],[163,43,164,43],[110,29,110,39],[110,41,110,43],[111,41,112,41],[111,42,112,42],[111,43,112,43],[138,29,138,39],[138,41,138,43],[139,41,140,41],[139,42,140,42],[139,43,140,43],[162,41,162,43],[139,39,140,39],[85,14,85,27],[86,24,87,24],[86,25,87,25],[86,26,87,26],[86,27,87,27],[85,4,87,4],[85,5,87,5],[85,6,87,6],[85,8,87,8],[85,9,87,9],[85,10,87,10],[122,7,122,9],[123,5,123,6],[123,7,123,9],[129,5,129,6],[129,7,129,9],[119,5,119,6],[119,7,119,9],[120,5,120,6],[120,7,120,9],[121,5,121,6],[124,7,124,9],[125,7,125,9],[126,7,126,9],[127,7,127,9],[128,7,128,9],[124,5,124,6],[125,5,125,6],[126,5,126,6],[127,5,127,6],[128,5,128,6],[185,12,187,12],[185,13,187,13],[173,4,173,5],[173,6,173,7],[174,4,174,5],[174,6,174,7],[175,4,175,5],[175,6,175,7],[176,6,176,7],[177,6,177,7],[178,6,178,7],[179,6,179,7],[180,6,180,7],[176,4,176,5],[177,4,177,5],[178,4,178,5],[179,4,179,5],[180,4,180,5],[185,8,187,8],[185,9,187,9],[185,4,187,6],[185,7,187,7],[185,10,187,10],[185,11,187,11],[211,27,212,27],[244,14,244,24],[198,4,198,6],[204,4,204,6],[205,4,205,13],[227,12,229,12],[227,4,229,4],[245,24,246,24],[199,4,199,6],[200,4,200,6],[201,4,201,6],[202,4,202,6],[203,4,203,6],[228,26,229,26],[227,11,229,11],[211,26,212,26],[210,12,212,12],[210,13,212,13],[210,4,212,9],[213,4,213,9],[214,4,214,9],[215,4,215,9],[211,25,212,25],[227,29,227,39],[227,41,227,43],[228,41,229,41],[228,42,229,42],[228,43,229,43],[3,14,3,27],[188,4,188,6],[189,4,189,6],[190,4,190,6],[191,4,191,6],[195,4,195,6],[196,4,196,6],[197,4,197,6],[185,14,185,27],[186,24,187,24],[186,25,187,25],[186,26,187,26],[186,27,187,27],[186,39,187,39],[181,4,181,5],[181,6,181,7],[182,4,182,13],[171,6,171,7],[172,4,172,5],[5,3,7,3],[227,13,229,13],[227,14,227,27],[228,24,229,24],[228,25,229,25],[228,27,229,27],[228,39,229,39],[210,14,210,27],[211,24,212,24],[216,4,216,9],[217,4,217,9],[218,4,218,9],[210,10,212,10],[210,11,212,11],[219,4,219,9],[220,4,220,9],[221,4,221,9],[222,4,222,9],[223,4,223,9],[224,4,224,13],[211,39,212,39],[170,4,170,5],[170,6,170,7],[171,4,171,5],[172,6,172,7],[167,4,167,5],[167,6,167,7],[168,4,168,5],[168,6,168,7],[169,4,169,5],[169,6,169,7],[163,27,164,27],[163,39,164,39],[165,4,165,5],[165,6,165,7],[166,6,166,7],[162,11,164,11],[162,12,164,12],[162,13,164,13],[162,14,162,27],[163,24,164,24],[163,25,164,25],[163,26,164,26],[155,4,155,5],[156,4,156,5],[157,4,157,5],[158,4,158,13],[162,4,164,5],[162,6,164,7],[162,8,164,8],[162,9,164,9],[162,10,164,10],[157,6,157,7],[149,4,149,5],[150,4,150,5],[151,4,151,5],[152,4,152,5],[153,4,153,5],[154,4,154,5],[143,4,143,5],[144,4,144,5],[145,4,145,5],[146,4,146,5],[147,4,147,5],[148,4,148,5],[138,14,138,27],[139,24,140,24],[139,25,140,25],[139,26,140,26],[138,4,140,5],[138,8,140,8],[138,9,140,9],[139,27,140,27],[138,11,140,12],[138,6,140,7],[53,4,53,5],[61,4,63,4],[61,5,63,5],[38,4,38,5],[39,4,39,5],[40,4,40,5],[44,4,44,5],[141,4,141,5],[142,4,142,5],[122,5,122,6],[51,4,51,5],[50,4,50,5],[49,4,49,5],[48,4,48,5],[47,4,47,5],[47,6,47,9],[48,6,48,9],[49,6,49,9],[50,6,50,9],[51,6,51,9],[141,6,141,7],[142,6,142,7],[45,4,45,5],[46,4,46,5],[35,14,35,27],[36,24,37,24],[36,27,37,27],[36,39,37,39],[38,6,38,9],[39,6,39,9],[40,6,40,9],[35,10,37,10],[35,11,37,11],[35,12,37,12],[35,13,37,13],[35,6,37,9],[35,29,35,39],[28,4,28,5],[28,6,28,8],[29,4,29,5],[29,6,29,8],[24,4,24,5],[24,6,24,8],[25,4,25,5],[25,6,25,8],[26,4,26,5],[26,6,26,8],[41,4,41,5],[249,10,249,13],[244,10,246,13],[250,10,250,13],[251,10,251,13],[252,10,252,13],[253,4,253,7],[253,8,253,9],[253,10,253,13],[53,6,53,9],[110,7,112,9],[110,10,112,10],[110,11,112,11],[110,12,112,12],[110,13,112,13],[121,7,121,9],[116,5,116,6],[116,7,116,9],[117,5,117,6],[117,7,117,9],[61,8,63,8],[61,9,63,9],[81,4,81,13],[82,5,82,13],[254,4,254,7],[254,8,254,9],[254,10,254,13],[252,4,252,7],[251,4,251,7],[250,4,250,7],[249,4,249,7],[244,4,246,7],[252,8,252,9],[251,8,251,9],[250,8,250,9],[249,8,249,9],[244,8,246,9],[247,4,247,7],[247,8,247,9],[247,10,247,13],[248,4,248,7],[248,8,248,9],[248,10,248,13],[263,4,263,7],[263,8,263,9],[263,10,263,13],[255,4,255,7],[255,8,255,9],[255,10,255,13],[256,4,256,7],[256,8,256,9],[256,10,256,13],[257,4,257,7],[257,8,257,9],[257,10,257,13],[110,4,112,4],[110,5,112,6],[61,10,63,10],[61,11,63,11],[61,12,63,12],[61,13,63,13],[105,4,105,13],[85,11,87,12],[85,7,87,7],[85,13,87,13],[107,11,108,11],[52,6,52,9],[1,5,1,13],[2,5,2,13],[9,9,9,13],[11,10,11,13],[11,4,11,8],[12,4,12,5],[12,6,12,8],[13,4,13,5],[13,6,13,8],[52,4,52,5],[42,4,42,5],[43,4,43,5],[41,6,41,9],[42,6,42,9],[43,6,43,9],[44,6,44,9],[45,6,45,9],[46,6,46,9],[30,6,30,8],[31,4,31,5],[31,6,31,8],[35,4,37,5],[18,6,18,8],[14,4,14,5],[15,4,15,5],[17,4,17,5],[19,4,19,5],[16,4,16,5],[20,4,20,5],[18,4,18,5],[27,4,27,5],[27,6,27,8],[21,4,21,5],[21,6,21,8],[14,6,14,8],[15,6,15,8],[17,6,17,8],[19,6,19,8],[16,6,16,8],[20,6,20,8],[22,4,22,5],[22,6,22,8],[23,4,23,5],[23,6,23,8],[61,45,63,45],[85,45,87,45],[192,4,192,6],[193,4,193,6],[194,4,194,6],[61,14,61,27],[62,24,63,24],[62,25,63,25],[62,26,63,26],[62,27,63,27],[62,39,63,39],[110,14,110,27],[111,24,112,24],[111,25,112,25],[111,26,112,26],[111,27,112,27],[61,6,63,6],[61,7,63,7],[151,6,151,7],[152,6,152,7],[153,6,153,7],[154,6,154,7],[155,6,155,7],[156,6,156,7],[144,6,144,7],[143,6,143,7],[145,6,145,7],[146,6,146,7],[147,6,147,7],[148,6,148,7],[149,6,149,7],[150,6,150,7],[110,45,112,45],[111,39,112,39],[118,5,118,6],[118,7,118,9],[113,5,113,6],[113,7,113,9],[114,5,114,6],[114,7,114,9],[115,5,115,6],[115,7,115,9],[130,4,130,13],[131,5,131,13],[133,5,133,13],[135,5,135,13],[138,10,140,10],[138,13,140,13]]}
[null,null,null,3,{"$f":"\"    \"&Title!$D$6","v":"    UoA Costing Pricing Tool (CPT)"},null,null,null,null,null,null,null,null,null,null,null,null,null,null,null,null,null,null,null,"Click on the \"+\"  above to expand years",null,null,null,null,null,null,null,null,null,null,null,null,null,null,"Click on the \"+\" above to expand years"]
[null,null,null,null,null,{"$f":"Title!$D$1","v":"This file has expired. Existing CPMs can still be viewed. However, for new applications, please download the current file from"}]
[null,null,null,null,null,{"$f":"Title!$D$4","v":"https://www.adelaide.edu.au/finance/"}]
[null,null,null,"     ","              ** NOTE** Calculator for internal University of Adelaide use only. Must not be shared with External Parties.",null,null,null,null,null,null,null,null,null,"Project Costing",null,null,null,null,null,null,null,null,null,null,null,null,null,null,"Project Pricing (Direct)",null,null,null,null,null,null,null,null,null,null,null,"Inkind and Ineligible Expenses"]
[]
[]
{"$rows_left_out":260}
{"sheet":"Summary","index":5,"n_rows":75,"n_cols":10,"rows_kept":75,"cut":false,"hidden":false,"merged":[[21,1,22,5],[34,7,35,11],[9,2,9,3],[9,5,9,6],[12,2,12,3],[10,2,10,3],[14,2,14,3],[10,5,10,6],[11,2,11,3],[11,5,11,6],[13,2,13,3],[12,5,12,6],[13,5,13,6],[1,2,2,10],[6,5,6,9],[7,2,7,3],[7,5,7,6],[8,2,8,3],[8,5,8,6],[3,2,3,10],[60,4,61,10],[15,2,15,3],[16,2,16,3],[56,4,56,5],[55,4,55,5],[54,4,54,5],[53,4,53,5],[56,2,56,3],[55,2,55,3],[54,2,54,3],[19,2,19,3],[53,2,53,3],[17,2,17,3],[38,7,38,11],[18,2,18,3],[21,7,22,11]]}
[null,{"$f":"\"              \"&Title!$D$6","v":"              UoA Costing Pricing Tool (CPT)"},null,null,null,null,"Automatically populated"]
[null,null,{"$f":"Title!$D$1","v":"This file has expired. Existing CPMs can still be viewed. However, for new applications, please download the current file from"}]
[]
[null,null,{"$f":"Title!$D$4","v":"https://www.adelaide.edu.au/finance/"}]
[null,"                               ** NOTE** Calculator for internal University of Adelaide use only. Must not be shared with External Parties."]
[]
{"$rows_left_out":70}
{"sheet":"Major Funder Tables (DRAFT)","index":6,"n_rows":16,"n_cols":9,"rows_kept":16,"cut":false,"hidden":true,"merged":[]}
["Tables linked to pricing - formated to suit major funders submission formats"]
[]
["ARC"]
["NHRMC "]
["DSTG"]
[]
{"$rows_left_out":11}
{"sheet":"Expenditure Plan","index":7,"n_rows":23,"n_cols":3,"rows_kept":23,"cut":false,"hidden":false,"merged":[[1,1,1,2]]}
[]
[null,"Project Expenditure Authority"]
[null,{"$f":"IF(ISBLANK($D$21),\"\",$D$21)","v":""},"Funded "]
[null,"Salaries",{"$f":"Summary!D26","v":0}]
[null,"Stipend",{"$f":"'ENTER DETAILS HERE_Costing Tab'!AN183","v":0}]
[null,"Travel",{"$f":"'ENTER DETAILS HERE_Costing Tab'!AN206","v":0}]
{"$rows_left_out":18}
{"sheet":"Foreign Exchange - OPTIONAL","index":8,"n_rows":16,"n_cols":4,"rows_kept":16,"cut":false,"hidden":false,"merged":[[1,2,1,3],[1,1,2,1],[13,1,13,2]]}
[]
[null,"Foreign Exchange","Pricing (to Funder)"]
[null,null,"AUD",{"$f":"IF(ISBLANK($C$15),\"\",$C$15)","v":""}]
[null,"Staff Costs ",{"$f":"Summary!D26","v":0},{"$f":"C4*$C$16","v":0}]
[null,"Operating Expenses excl Collaborators",{"$f":"Summary!D27","v":0},{"$f":"C5*$C$16","v":0}]
[null,"Collaborators",{"$f":"Summary!D28","v":0},0]
{"$rows_left_out":11}
{"sheet":"In-kind Calculator - OPTIONAL","index":9,"n_rows":73,"n_cols":3,"rows_kept":73,"cut":false,"hidden":false,"merged":[]}
["Calculating University In-kind (Direct and Indirect) for Research Grants (typically used for RDCs and other industry grants)"]
[]
["Indirect costs represent the cost to the University in providing its personnel with the infrastructure necessary to support the research activity undertaken. "]
["This includes:"]
["-       the provision and maintenance of buildings and physical infrastructure including access to equipment and lab facilities"]
["-       university-wide information resources and technology"]
{"$rows_left_out":68}
{"sheet":"Quick Salary Calc - OPTIONAL","index":10,"n_rows":29,"n_cols":18,"rows_kept":29,"cut":false,"hidden":false,"merged":[[19,11,19,17],[4,3,4,6]]}
[1]
[null,null,"SALARY ESTIMATOR"]
[]
[null,null,"     Input",null,null,null,null,null,null,"        Workings"]
[null,null,"Position: ",null,null,null,null,null,null,null,"Year:",{"$f":"+YEAR(TODAY())","v":2024},{"$f":"+L5+1","v":2025},{"$f":"+M5+1","v":2026},{"$f":"+N5+1","v":2027},{"$f":"+O5+1","v":2028},{"$f":"+P5+1","v":2029},"Total"]
[null,null,null,null,null,null,null,null,null,null,"Step:",{"$f":"IF(E13=L5,IF(D10=\"UNK\",\"N/A\",D10),0)","v":0},{"$f":"IFERROR(IF(L6=0,IF($E13=M5,$D10,0),IF(M5>$E14,0,IF((L6+1)>'Staff Salaries'!$AB$20,'Staff Salaries'!$AB$20,(L6+1)))),\"N/A\")","v":0},{"$f":"IFERROR(IF(M6=0,IF($E13=N5,$D10,0),IF(N5>$E14,0,IF((M6+1)>'Staff Salaries'!$AB$20,'Staff Salaries'!$AB$20,(M6+1)))),\"N/A\")","v":0},{"$f":"IFERROR(IF(N6=0,IF($E13=O5,$D10,0),IF(O5>$E14,0,IF((N6+1)>'Staff Salaries'!$AB$20,'Staff Salaries'!$AB$20,(N6+1)))),\"N/A\")","v":0},{"$f":"IFERROR(IF(O6=0,IF($E13=P5,$D10,0),IF(P5>$E14,0,IF((O6+1)>'Staff Salaries'!$AB$20,'Staff Salaries'!$AB$20,(O6+1)))),\"N/A\")","v":0},{"$f":"IFERROR(IF(P6=0,IF($E13=Q5,$D10,0),IF(Q5>$E14,0,IF((P6+1)>'Staff Salaries'!$AB$20,'Staff Salaries'!$AB$20,(P6+1)))),\"N/A\")","v":0}]
{"$rows_left_out":24}
{"sheet":"HERDC Info","index":11,"n_rows":4,"n_cols":1,"rows_kept":4,"cut":false,"hidden":false,"merged":[]}
["For Information on Higher Edcuation Research Data Collection Categories, \nclick on link below or \nrefer table for Category 1"]
[]
["Link to HERDC Site - "]
["Higher Education Research Data Collection - Department of Education, Australian Government"]

{"sheet":"Staff Salaries","index":12,"n_rows":689,"n_cols":28,"rows_kept":689,"cut":false,"hidden":true,"merged":[]}
[]
["Code","Grade","Step","Year","Calendar","EB","EB Year",null,45108,45472,45836,46201,46566,46932,47299,null,"On Costs:",null,null,null,null,null,null,null,null,null,"Grade","Max"]
["ACA","LEVEL A",1,2023,{"$f":"(F605/2)+(F3/2)","v":74358.409},{"$f":"F605*(1+$I$3)","v":75887.817999999999},"2023-24",null,4.2000000000000003E-2,3.5000000000000003E-2,3.5000000000000003E-2,3.5000000000000003E-2,3.5000000000000003E-2,3.5000000000000003E-2,3.5000000000000003E-2,null,"Payroll Tax",4.9500000000000002E-2,"Payroll Tax = 4.95% *(Base Salary + Loadings + Super + AL Loadings)",null,null,null,null,null,null,null,"LEVEL A",{"$f":"MAX(LEVEL_A)","v":8}]
["ACA","LEVEL A",2,2023,78461.808000000005,80075.616000000009,"2023-24",null,null,null,null,null,null,null,null,null,"Workers Compensation",5.0000000000000001E-3,"Workcover = 0.5% * (Base Salary + Loadings + Super + AL Loadings)",null,null,null,null,null,null,null,"LEVEL B",{"$f":"MAX(LEVEL_B)","v":6}]
["ACA","LEVEL A",3,2023,82557.039000000004,84255.078000000009,"2023-24",null,null,null,null,null,null,null,null,null,"Long Service Leave Provision",3.2500000000000001E-2,"LSL Provision = 3.25% * (Base Salary + Loadings)",null,null,null,null,null,null,null,"LEVEL C",{"$f":"MAX(LEVEL_C)","v":6}]
["ACA","LEVEL A",4,2023,86657.375,88439.75,"2023-24",null,null,null,null,null,null,null,null,null,null,null,null,null,null,null,null,null,null,null,"LEVEL D",{"$f":"MAX(LEVEL_D)","v":4}]
{"$rows_left_out":684}
{"sheet":"Drop Down","index":13,"n_rows":13,"n_cols":31,"rows_kept":13,"cut":false,"hidden":true,"merged":[]}
[null,null,null,null,"ACA Levels",null,null,null,null,null,"HEO Levels",null,null,null,null,null,null,null,null,null,null,null,null,null,0.17,null,1,null,2024,null,"Yes"]
["ACA","LEVEL A","HEO Level 1","UNK",null,1,1,1,1,1,null,1,1,1,1,1,1,1,1,1,1,1,1,null,0.1,null,2,null,2025,null,"No"]
["HEO","LEVEL B","HEO Level 2",null,null,2,2,2,2,null,null,2,2,2,2,2,2,2,2,2,2,2,2,null,null,null,3,null,2026]
["UNK","LEVEL C","HEO Level 3",null,null,3,3,3,3,null,null,3,3,3,3,3,3,3,3,3,3,3,3,null,null,null,4,null,2027]
[null,"LEVEL D","HEO Level 4",null,null,4,4,4,4,null,null,4,4,4,4,4,4,4,4,4,null,null,null,null,null,null,5,null,2028]
[null,"LEVEL E","HEO Level 5",null,null,5,5,5,null,null,null,5,5,5,null,null,5,null,5,5,null,null,null,null,null,null,6,null,2029]
{"$rows_left_out":8}
{"sheet":"ACAD","index":14,"n_rows":102,"n_cols":12,"rows_kept":102,"cut":false,"hidden":true,"merged":[]}
["The University of Adelaide Enterprise Agreement 2017 – 2021",null,null,null,null,0.02,{"$f":"#REF!","v":{"$error":"#REF!"}},{"$f":"#REF!","v":{"$error":"#REF!"}},{"$f":"#REF!","v":{"$error":"#REF!"}},{"$f":"#REF!","v":{"$error":"#REF!"}},{"$f":"#REF!","v":{"$error":"#REF!"}},{"$f":"#REF!","v":{"$error":"#REF!"}}]
["SCHEDULE 1: ACADEMIC STAFF ANNUAL SALARIES"]
[null,"Salary effective from 3 March 2018 ($2000 uplift)","Salary effective from 2 March 2019\n(1.5%\nincrease)","Salary effective from 14 March 2020\n(1.5% increase\n+ $400 uplift)","Salary effective from 13 March 2021\n(1.5%\nincrease)",2022,2023,2024,2025,2026,2027,2028]
["LEVEL A",null,null,null,null,null,"Yr 1","Yr 2","Yr 3","Yr 4","Yr 5","Yr 6"]
["LEVEL A1",67894,68912,70346,71401,{"$f":"E5*(1+F$1)","v":72829.02},{"$f":"F5*(1+G$1)","v":{"$error":"#REF!"}},{"$error":"#REF!"},{"$error":"#REF!"},{"$error":"#REF!"},{"$error":"#REF!"},{"$error":"#REF!"}]
["LEVEL A2",71662,72737,74228,75341,{"$f":"E6*(1+F$1)","v":76847.820000000007},{"$error":"#REF!"},{"$error":"#REF!"},{"$error":"#REF!"},{"$error":"#REF!"},{"$error":"#REF!"},{"$error":"#REF!"}]
{"$rows_left_out":97}
{"sheet":"IO","index":15,"n_rows":59,"n_cols":13,"rows_kept":59,"cut":false,"hidden":true,"merged":[[8,8,8,11]]}
["STATUS",null,null,null,null,"Salaries"]
["ACAD",null,"ACAD","PROF",null,null,null,null,"Period",null,"Conversion","Column1","Column2"]
["PROF",null,"LEVEL A1","H01_01",null,null,null,null,"Annually",null,"1 year",{"$f":"#REF!","v":{"$error":"#REF!"}},"weeks"]
[null,null,"LEVEL A2","H01_02",null,null,null,null,"Weekly",null,"1 week",36.75,"Hours"]
[null,null,"LEVEL A3","H01_03",null,null,null,null,"Daily",null,"1 Day",7.35,"Hours"]
[null,null,"LEVEL A4","H01_04",null,null,null,null,"Hourly"]
{"$rows_left_out":53}